It is currently Mon Oct 23, 2017 9:11 am

All times are UTC [ DST ]




 Page 1 of 1 [ 2 posts ] 
Author Message
 Post subject: GNUworld builiding
PostPosted: Thu Feb 25, 2010 2:21 pm 

Joined: Sun Feb 14, 2010 7:39 pm
Posts: 10
hey all
when i
http://www.gnuworld.org/gnuworld-setup/ ... subset=B-2

cd gnuworld
./configure --enable-modules=cservice
make


i get
pgsqlDB.cc:141: error: 'status' was not declared in this scope
pgsqlDB.cc:142: error: 'PGRES_COMMAND_OK' was not declared in this scope
pgsqlDB.cc:142: error: 'status' was not declared in this scope
pgsqlDB.cc:148: error: 'PGRES_COPY_IN' was not declared in this scope
pgsqlDB.cc:148: error: 'status' was not declared in this scope
pgsqlDB.cc:149: error: 'PGRES_TUPLES_OK' was not declared in this scope
pgsqlDB.cc:149: error: 'status' was not declared in this scope
pgsqlDB.cc:150: error: 'PGRES_COMMAND_OK' was not declared in this scope
pgsqlDB.cc:150: error: 'status' was not declared in this scope
pgsqlDB.cc: In member function 'virtual bool gnuworld::pgsqlDB::StopCopyIn()':
pgsqlDB.cc:167: error: 'lastResult' was not declared in this scope
pgsqlDB.cc:171: error: 'theDB' was not declared in this scope
pgsqlDB.cc:171: error: 'PQputCopyEnd' was not declared in this scope
pgsqlDB.cc: In member function 'virtual bool gnuworld::pgsqlDB::PutLine(const std::string&)':
pgsqlDB.cc:176: error: 'lastResult' was not declared in this scope
pgsqlDB.cc:180: error: 'theDB' was not declared in this scope
pgsqlDB.cc:180: error: 'PQputline' was not declared in this scope
pgsqlDB.cc: In member function 'virtual unsigned int gnuworld::pgsqlDB::countTuples() const':
pgsqlDB.cc:185: error: 'lastResult' was not declared in this scope
pgsqlDB.cc:189: error: 'lastResult' was not declared in this scope
pgsqlDB.cc:189: error: 'PQntuples' was not declared in this scope
pgsqlDB.cc: In member function 'virtual const std::string gnuworld::pgsqlDB::ErrorMessage() const':
pgsqlDB.cc:194: error: 'theDB' was not declared in this scope
pgsqlDB.cc:194: error: 'PQerrorMessage' was not declared in this scope
pgsqlDB.cc: In member function 'virtual const std::string gnuworld::pgsqlDB::GetValue(unsigned int, unsigned int) const':
pgsqlDB.cc:200: error: 'lastResult' was not declared in this scope
pgsqlDB.cc:204: error: 'lastResult' was not declared in this scope
pgsqlDB.cc:204: error: 'PQgetvalue' was not declared in this scope
pgsqlDB.cc: In member function 'virtual const std::string gnuworld::pgsqlDB::GetValue(unsigned int, const std::string&) const':
pgsqlDB.cc:210: error: 'lastResult' was not declared in this scope
pgsqlDB.cc:216: error: 'lastResult' was not declared in this scope
pgsqlDB.cc:216: error: 'PQfnumber' was not declared in this scope
pgsqlDB.cc:222: error: 'PQgetvalue' was not declared in this scope
pgsqlDB.cc: In member function 'virtual bool gnuworld::pgsqlDB::isConnected() const':
pgsqlDB.cc:227: error: 'CONNECTION_OK' was not declared in this scope
pgsqlDB.cc:227: error: 'theDB' was not declared in this scope
pgsqlDB.cc:227: error: 'PQstatus' was not declared in this scope
make[1]: *** [pgsqlDB.lo] Error 1
make[1]: Leaving directory `/home/gnuworld/gnuworld/db'
make: *** [all-recursive] Error 1

what's going on ?

thanks


Offline
 Profile  
 
 Post subject: Re: GNUworld builiding
PostPosted: Fri Feb 26, 2010 8:27 pm 

Joined: Sun Feb 14, 2010 7:39 pm
Posts: 10
I found solution.
[SOLVED]


Offline
 Profile  
 
Display posts from previous:  Sort by  
 Page 1 of 1 [ 2 posts ] 

All times are UTC [ DST ]


Who is online

Users browsing this forum: No registered users and 2 guests


You cannot post new topics in this forum
You cannot reply to topics in this forum
You cannot edit your posts in this forum
You cannot delete your posts in this forum
You cannot post attachments in this forum

Search for:
Jump to:  

cron